build failed again

classic Classic list List threaded Threaded
3 messages Options
Reply | Threaded
Open this post in threaded view
|

build failed again

Yoseph Widjaya
Hi all

Why build is failed again

here is the logs

BUILD FAILED
File......
/home/yosep/.maven/cache/maven-multiproject-plugin-1.3.1/plugin.jellyElement...
maven:reactor
Line...... 217
Column.... 9
Unable to obtain goal [default] --
/home/yosep/.maven/cache/maven-java-plugin-1.5/plugin.jelly:63:48:
<ant:javac> Compile failed; see the compiler error
output for details.
Total time: 16 minutes 3 seconds
Finished at: Sat Jul 09 11:49:27 EST 2005


many thanks


               
____________________________________________________
Sell on Yahoo! Auctions ? no fees. Bid on great items.  
http://auctions.yahoo.com/
Reply | Threaded
Open this post in threaded view
|

Re: build failed again

Alan Cabrera-2
Are you running maven 1.0.2?


Regards,
Alan

Yoseph Widjaya wrote, On 7/8/2005 8:18 PM:

>Hi all
>
>Why build is failed again
>
>here is the logs
>
>BUILD FAILED
>File......
>/home/yosep/.maven/cache/maven-multiproject-plugin-1.3.1/plugin.jellyElement...
>maven:reactor
>Line...... 217
>Column.... 9
>Unable to obtain goal [default] --
>/home/yosep/.maven/cache/maven-java-plugin-1.5/plugin.jelly:63:48:
><ant:javac> Compile failed; see the compiler error
>output for details.
>Total time: 16 minutes 3 seconds
>Finished at: Sat Jul 09 11:49:27 EST 2005
>
>
>many thanks
>
>
>
>____________________________________________________
>Sell on Yahoo! Auctions ? no fees. Bid on great items.  
>http://auctions.yahoo.com/
>  
>


Reply | Threaded
Open this post in threaded view
|

Re: build failed again

Yoseph Widjaya
Yes

--- "Alan D. Cabrera" <[hidden email]> wrote:

> Are you running maven 1.0.2?
>
>
> Regards,
> Alan
>
> Yoseph Widjaya wrote, On 7/8/2005 8:18 PM:
>
> >Hi all
> >
> >Why build is failed again
> >
> >here is the logs
> >
> >BUILD FAILED
> >File......
>
>/home/yosep/.maven/cache/maven-multiproject-plugin-1.3.1/plugin.jellyElement...
> >maven:reactor
> >Line...... 217
> >Column.... 9
> >Unable to obtain goal [default] --
>
>/home/yosep/.maven/cache/maven-java-plugin-1.5/plugin.jelly:63:48:
> ><ant:javac> Compile failed; see the compiler error
> >output for details.
> >Total time: 16 minutes 3 seconds
> >Finished at: Sat Jul 09 11:49:27 EST 2005
> >
> >
> >many thanks
> >
> >
> >
>
>____________________________________________________
> >Sell on Yahoo! Auctions ? no fees. Bid on great
> items.  
> >http://auctions.yahoo.com/
> >  
> >
>
>
>


__________________________________________________
Do You Yahoo!?
Tired of spam?  Yahoo! Mail has the best spam protection around
http://mail.yahoo.com